{"text_format":"1","workbook":"xlsx","n_sheets":6,"sheets":["cat","Codigos","Rótulo","Rótulo TP","Rótulo TS","Rótulo Bd"],"not_rendered":{"charts":0,"images":1,"macros":0,"external_links":0,"defined_names":74,"comments":0,"pivot_tables":0},"unopened":[],"bounds":{"document_bytes":16777216,"sheet_cells":100000,"rows_first":2000,"rows_last":500,"rows_between":2000,"halvings":0,"cell_chars":16384,"cell_head_chars":4096},"cells_cut":0,"cells_raw":0,"read":"whole","date_system":"1900"}

{"sheet":"cat","index":0,"n_rows":268,"n_cols":2,"rows_kept":268,"cut":false,"hidden":true,"merged":[]}
["CÓDIGO","ÁREA UNIVERSITARIA"]
[211,"COORDINACIÓN DE HUMANIDADES"]
[212,"INSTITUTO DE INVESTIGACIONES BIBLIOGRÁFICAS"]
[213,"INSTITUTO DE INVESTIGACIONES ECONÓMICAS"]
[214,"INSTITUTO DE INVESTIGACIONES ESTÉTICAS"]
[215,"INSTITUTO DE INVESTIGACIONES FILOSÓFICAS"]
[216,"INSTITUTO DE INVESTIGACIONES HISTÓRICAS"]
[217,"INSTITUTO DE INVESTIGACIONES JURÍDICAS"]
[218,"INSTITUTO DE INVESTIGACIONES SOCIALES"]
[219,"INSTITUTO DE INVESTIGACIONES FILOLÓGICAS"]
[221,"INSTITUTO DE INVESTIGACIONES ANTROPOLÓGICAS"]
[222,"INSTITUTO DE INVESTIGACIONES SOBRE LA UNIVERSIDAD Y LA EDUCACIÓN"]
[223,"INSTITUTO DE INVESTIGACIONES BIBLIOTECOLÓGICAS Y DE LA INFORMACIÓN"]
[311,"COORDINACIÓN DE LA INVESTIGACIÓN CIENTÍFICA"]
[312,"INSTITUTO DE ASTRONOMÍA"]
[313,"INSTITUTO DE BIOLOGÍA"]
[314,"INSTITUTO DE FÍSICA"]
[315,"INSTITUTO DE GEOFÍSICA"]
[316,"INSTITUTO DE GEOGRAFÍA"]
[317,"INSTITUTO DE GEOLOGÍA"]
[318,"INSTITUTO DE INVESTIGACIONES BIOMÉDICAS"]
[319,"INSTITUTO DE MATEMÁTICAS"]
[321,"INSTITUTO DE QUÍMICA"]
[322,"INSTITUTO DE INVESTIGACIONES EN MATEMÁTICAS APLICADAS Y EN SISTEMAS"]
[323,"INSTITUTO DE INGENIERÍA"]
[324,"INSTITUTO DE INVESTIGACIONES EN MATERIALES"]
[325,"INSTITUTO DE CIENCIAS DEL MAR Y LIMNOLOGÍA"]
[326,"INSTITUTO DE FISIOLOGÍA CELULAR"]
[327,"INSTITUTO DE CIENCIAS NUCLEARES"]
[328,"INSTITUTO DE BIOTECNOLOGÍA EN CUERNAVACA, MORELOS"]
[329,"INSTITUTO DE ECOLOGÍA"]
[331,"INSTITUTO DE NEUROBIOLOGÍA EN QUERÉTARO, QUERÉTARO"]
[332,"INSTITUTO DE CIENCIAS FÍSICAS EN CUERNAVACA, MORELOS"]
[333,"INSTITUTO DE ENERGÍAS RENOVABLES EN TEMIXCO, MORELOS"]
[334,"INSTITUTO DE INVESTIGACIONES EN ECOSISTEMAS Y SUSTENTABILIDAD EN MORELIA, MICHOACÁN"]
[335,"INSTITUTO DE RADIOASTRONOMÍA Y ASTROFÍSICA EN MORELIA, MICHOACÁN"]
[336,"INSTITUTO DE CIENCIAS APLICADAS Y TECNOLOGÍA"]
[337,"INSTITUTO DE CIENCIAS DE LA ATMÓSFERA Y CAMBIO CLIMÁTICO"]
[338,"INSTITUTO DE GEOCIENCIAS"]
[411,"FACULTAD DE CIENCIAS"]
[412,"FACULTAD DE CIENCIAS POLÍTICAS Y SOCIALES"]
[413,"FACULTAD DE CONTADURÍA Y ADMINISTRACIÓN"]
[414,"FACULTAD DE DERECHO"]
[415,"FACULTAD DE FILOSOFÍA Y LETRAS"]
[416,"FACULTAD DE INGENIERÍA"]
[417,"FACULTAD DE MEDICINA"]
[418,"FACULTAD DE QUÍMICA"]
[419,"FACULTAD DE MEDICINA VETERINARIA Y ZOOTECNIA"]
[421,"FACULTAD DE ODONTOLOGÍA"]
[422,"FACULTAD DE PSICOLOGÍA"]
[423,"FACULTAD DE ECONOMÍA"]
[424,"FACULTAD DE ARQUITECTURA"]
[425,"FACULTAD DE ARTES Y DISEÑO"]
[426,"FACULTAD DE MÚSICA"]
[427,"FACULTAD DE ENFERMERÍA Y OBSTETRICIA"]
[431,"ESCUELA NACIONAL DE CIENCIAS FORENSES"]
[436,"ESCUELA NACIONAL DE TRABAJO SOCIAL"]
[437,"ESCUELA NACIONAL DE LENGUAS, LINGÜÍSTICA Y TRADUCCIÓN"]
[438,"ESCUELA NACIONAL DE CIENCIAS DE LA TIERRA"]
[439,"ESCUELA NACIONAL DE ARTES CINEMATOGRÁFICAS"]
{"$rows_left_out":209}
{"sheet":"Codigos","index":1,"n_rows":47,"n_cols":25,"rows_kept":47,"cut":false,"hidden":true,"merged":[]}
["SECCION",null,"1S DOCENCIA","2S INVESTIGACIÓN","3S DIFUSIÓN Y EXTENSIÓN DE LA CULTURA","4S GOBIERNO","1C LEGISLACIÓN UNIVERSITARIA","2C ASUNTOS JURÍDICOS","3C ORGANIZACIÓN PROGRAMACIÓN Y PRESUPUESTACIÓN","4C RECURSOS HUMANOS","5C RECURSOS FINANCIEROS","6C RECURSOS MATERIALES Y OBRAS","7C SERVICIOS GENERALES","8C TECNOLOGÍAS DE LA INFORMACIÓN Y LA COMUNICACIÓN Y SERVICIOS DE LA INFORMACIÓN","9C COMUNICACIÓN SOCIAL","10C CONTROL Y AUDITORÍA","11C PLANEACIÓN EVALUACIÓN E INFORMACIÓN","12C TRANSPARENCIA ACCESO A LA INFORMACIÓN Y PROTECCIÓN DE DATOS PERSONALES","ELIGE LA SECCION"]
["_1S_DOCENCIA",null,".1 Disposiciones en materia de docencia",".1 Programas en materia de investigación",".1 Programas y proyectos en materia de difusión, extensión de la cultura",".1 Mensajes de autoridades",".1 Disposiciones en materia de legislación",".1 Programas y proyectos en materia de asuntos jurídicos",".1  Normas y políticas en materia de programación, organización y presupuestación",".1 Programas y proyectos en materia de recursos humanos",".1 Programas y proyectos en materia de recursos financieros y contables",".1 Programas y proyectos en materia de recursos materiales, obras, conservación y mantenimiento",".1 Programas y proyectos en materia de servicios generales y movilidad",".1 Programas y proyectos en materia de tecnologías de la información y la comunicación",".1 Programas y proyectos en materia de comunicación social",".1 Programas y proyectos en materia de control y auditoría",".1 Programas y proyectos en materia de información y evaluación",".1 Programas y proyectos en materia de acceso a la información y protección de datos personales","_ELIGE_LA_SERIE"]
["_2S_INVESTIGACIÓN",null,".2 Programas y proyectos en materia de docencia",".2 Proyectos de investigación",".2 Actividades culturales",".2 Sesiones de cuerpos colegiados",".2 Programas y proyectos en materia de legislación",".2 Actuación y representación",".2 Programas y proyectos en materia de programación",".2 Laborales de los trabajadores universitarios",".2 Egresos",".2 Adquisición, arrendamiento y servicios",".2 Atención a la salud",".2 Desarrollo e infraestructura de telecomunicaciones",".2 Publicaciones e impresos institucionales",".2 Auditoría, intervenciones y visitas de inspección",".2 Plan de Desarrollo Institucional",".2 Programas y proyectos en materia de transparencia"]
["_3S_DIFUSIÓN_Y_EXTENSIÓN_DE_LA_CULTURA",null,".3 Planes y programas de estudio",".3 Programas y proyectos de fomento y apoyo a la investigación","_.3_Programas_de_extensión_universitaria",".3 Dictámenes","_.3_Ordenamientos_jurídicos_universitarios",".3 Asistencias, asesorías y consultas",".3 Programas y proyectos en materia de presupuestación",".3 Registro y control de plazas",".3 Ingresos",".3 Obras",".3 Servicios básicos",".3 Supercómputo",".3 Material multimedia",".3 Requerimientos de información al área universitaria",".3 Programa de trabajo institucional",".3 Solicitudes de acceso a la información"]
["_4S_GOBIERNO",null,"_.4_Incorporación_de_planes_de_estudio",".4 Programas de vinculación, colaboración, asesorías, estudios y diagnósticos",".4 Programas de extensión artística y cultural",".4 Nombramientos y designaciones",".4 Acuerdos",".4 Procedimientos donde la Universidad Nacional Autónoma de México es parte",".4 Programas y proyectos en materia de organización",".4 Nóminas institucionales",".4 Estados financieros",".4 Seguros y fianzas",".4 Seguridad y vigilancia",".4 Control de calidad de software y hardware",".4 Publicidad institucional",".4 Investigación por presuntas faltas administrativas",".4 Informes institucionales",".4 Portal de transparencia"]
["_1C_LEGISLACIÓN_UNIVERSITARIA",null,"_.5_Revalidación_de_estudios_o_equivalencia_de_estudios",".5 Premios y distinciones en materia de investigación",".5 Publicación y fomento editorial",".5 Elecciones universitarias",".5 Lineamientos",".5 Procedimientos penales",".5 Programación presupuestal",".5 Reclutamiento y selección",".5 Libros contables",".5 Calidad en materia de obras, conservación y equipamiento",".5 Limpieza, higiene y fumigación",".5 Asesoría en tecnologías de la información, comunicación y servicios de la información",".5 Entrevistas para medios","_.5_Procedimientos_administrativos_en_forma_de_juicio",".5 Planes de desarrollo",".5 Índice de expedientes clasificados"]
["_2C_ASUNTOS_JURÍDICOS",null,".6 Movilidad estudiantil",".6 Programas y proyectos de evaluación a la investigación",".6 Programas de desarrollo deportivo",".6 Resolución de conflictos",".6 Criterios de interpretación",".6 Procedimientos de investigación administrativa",".6 Dictaminación técnica de estructuras administrativas",".6 Incidencias del personal",".6 Registro y control de pólizas de egresos",".6 Precios unitarios en obras y servicios",".6 Transporte, movilidad y estacionamientos",".6 Programas y proyectos en materia de informática",".6 Boletines informativos para medios",".6 Declaración de situación patrimonial y de intereses",".6 Programas de trabajo","_.6_Proteccion_de_datos_personales"]
["_3C_ORGANIZACIÓN_PROGRAMACIÓN_Y_PRESUPUESTACIÓN",null,".7 Cooperación docente",null,".7 Programas de recreación universitaria",".7 Recomendaciones",".7 Instrumentos Jurídicos Consensuales","_.7_Procedimientos_administrativos_no_contenciosos",".7 Manuales, normas y lineamientos de organización, procesos y procedimientos",".7 Descuentos",".7 Registro y control de pólizas de ingresos",".7 Asesoría técnica en materia de obras",".7 Telefonía, telefonía celular y radiocomunicación","_.7_Seguridad_informática",".7 Inserciones y anuncios en medios",".7 Entrega – recepción de cargo o puesto",".7 Informes",".7 Recursos de revisión"]
["_4C_RECURSOS_HUMANOS",null,"_.8_Prácticas_académicas",null,".8 Actividades deportivas",".8 Procedimientos disciplinarios sobre faltas a la Legislación Universitaria",".8 Registro y certificación de firmas",".9 Trámites migratorios y consulares",".8 Programas de mejora administrativa",".8 Estímulos",".8 Pólizas de diario",".8 Conservación, mantenimiento, remodelación y equipamiento",".8 Correspondencia y paquetería",".8 Análisis, desarrollo y programación de sistemas",".8 Cobertura de actos y eventos institucionales",".8 Libros blancos",".8 Información estadística",".8 Resoluciones del Comité de Transparencia"]
["_5C_RECURSOS_FINANCIEROS",null,".9 Educación continua",null,".9 Premios y distinciones en materia de difusión y extensión de la cultura",".9 Premios, distinciones y reconocimientos recibidos por la Universidad Nacional Autónoma de México",null,".10 Quejas y recomendaciones en materia de Derechos Humanos",".9 Certificación de calidad de procesos y servicios",".9 Concursos de oposición",".9 Auxiliares de cuentas",".9 Registro y control de proveedores y contratistas",".9 Mantenimiento, conservación e instalación de mobiliario",".9 Automatización de procesos",".9 Redes sociales",".9 Reclamaciones",".9 Indicadores de desempeño, calidad y productividad","_.9_Obligaciones_de_transparencia"]
["_6C_RECURSOS_MATERIALES_Y_OBRAS",null,".10 Alumnos",null,".10 Premios y distinciones al desarrollo deportivo",".10 Representación institucional",null,"_.11_Derechos_Universitarios",".10 Desconcentración y descentralización de funciones académicas y administrativas",".10 Prestaciones contractuales",".10 Conciliaciones",".10 Registro y control del inventario de activo fijo",".10 Mantenimiento, conservación e instalación de equipo de cómputo",".10 Control y modernización de los recursos informáticos",null,".10 Revocación"]
["_7C_SERVICIOS_GENERALES",null,"_.11_Servicios_educativos",null,".11 Programas y proyectos en materia de apoyo a la comunidad universitaria",null,null,"_.12_Derechos_de_propiedad_industrial",null,".11 Programas de retiro voluntario",".11 Asignación y optimización de recursos financieros",".11 Inventario físico y control de bienes muebles",".11 Control del parque vehicular",".11 Desarrollo, actualización y mantenimiento de página web institucional",null,".11 Programas y proyectos en materia de prevención y mejora Institucional"]
["_8C_TECNOLOGÍAS_DE_LA_INFORMACIÓN_Y_LA_COMUNICACIÓN_Y_SERVICIOS_DE_LA_INFORMACIÓN",null,".12 Becas",null,".12 Actividades en materia de apoyo a la comunidad universitaria",null,null,"_.13_Derechos_de_autor",null,".12 Asuntos laborales",".12 Valores financieros",".12 Inventario físico y control de bienes inmuebles",".12 Control de combustible",".12 Programas y proyectos en materia de servicios de la información"]
["_9C_COMUNICACIÓN_SOCIAL",null,".13 Tutorías",null,".13 Programas y proyectos en materia de igualdad, equidad de género, inclusión, prevención de la violencia de género y no \ndiscriminación.",null,null,".14 Mecanismos alternativos de solución de controversias",null,".13 Constancias y credenciales",".13 Estado del ejercicio del presupuesto",".13 Almacenamiento, control y abastecimiento de bienes y materiales",".13 Administración de auditorios, salas, estadios y otras instalaciones","_.13_Gestión_documental_y_administración_de_archivos"]
["_10C_CONTROL_Y_AUDITORÍA",null,".14 Trayectoria y productividad del personal académico",null,".14 Sensibilización y capacitación en materia de igualdad de género y prevención de la violencia de género",null,null,null,null,".14 Contratación de servicios profesionales",".14 Transferencias del presupuesto",".14 Control de calidad de bienes e insumos",".14 Programas y proyectos en materia de prevención y protección civil","_.14_Administración_de_bibliotecas"]
["_11C_PLANEACIÓN_EVALUACIÓN_E_INFORMACIÓN",null,".15 Programas de apoyo a la docencia",null,".15 Asistencia, asesoría y consulta en materia de igualdad de género y prevención de la violencia de género",null,null,null,null,".15 Pago por otros servicios",".15 Ampliaciones del presupuesto",".15 Control y seguimiento de obras, remodelaciones y equipamiento",".15 Capacitación y adiestramiento en materia de prevención y protección civil",".15 Administración de otros centros de documentación"]
["_12C_TRANSPARENCIA_ACCESO_A_LA_INFORMACIÓN_Y_PROTECCIÓN_DE_DATOS_PERSONALES",null,".16 Convocatorias y premios académicos",null,null,null,null,null,null,".16 Capacitación y adiestramiento al personal",".16 Aportaciones a capital",".19 Control de material químico y / o biológico",".16 Análisis de riesgo",".16 Administración y preservación de acervos digitales"]
["_ELIGE_LA_SECCIÓN",null,".17 Actas de calificaciones",null,null,null,null,null,null,".17 Premios y distinciones al personal",".17 Créditos concedidos",".20 Patrimonio cultural de la UNAM",".17 Asesorías en materia de prevención y protección civil",".17 Procesos técnicos en los servicios de la información"]
[null,null,".18 Titulación y graduación",null,null,null,null,null,null,".18 Banco de horas",".18 Cuentas por liquidar",null,null,".18 Productos para la divulgación de servicios"]
[null,null,"_.19_Evaluación_e_innovación_educativa",null,null,null,null,null,null,".19 Evaluaciones de desempeño para las secretarías y unidades administrativas",".19 Garantías, fianzas y depósitos",null,null,".19 Servicios y productos de TIC"]
[null,null,".20 Ingreso a la Universidad Nacional Autónoma de México",null,null,null,null,null,null,null,".20 Compras directas"]
[null,null,null,null,null,null,null,null,null,null,".21 Control de cheques"]
[null,null,null,null,null,null,null,null,null,null,".22 Caja"]
[null,null,null,null,null,null,null,null,null,null,".23 Fondo fijo y revolvente"]
[null,null,null,null,null,null,null,null,null,null,".24 Inversiones"]
[null,null,null,null,null,null,null,null,null,null,".25 Fideicomisos"]
[null,null,null,null,null,null,null,null,null,null,".26 Cuenta anual"]
[null,null,null,null,null,null,null,null,null,null,".27 Bancos"]
[]
[]
[]
[null,"_.4_Incorporación_de_planes_de_estudio","_.5_Revalidación_de_estudios_o_equivalencia_de_estudios","_.11_Servicios_educativos","_.19_Evaluación_e_innovación_educativa","_.3_Programas_de_extensión_universitaria","_.3_Ordenamientos_jurídicos_universitarios","_.9_Procedimientos_administrativos_no_contenciosos","_.10_Pedimentos_solicitudes_y_requerimientos_no_contenciosos","_.11_Derechos_Universitarios","_.12_Derechos_de_propiedad_industrial","_.6_Planeación_institucional","_.7_Seguridad_informática","_.13_Gestión_documental_y_administración_de_archivos","_.18_Administración_de_bibliotecas","_.5_Procedimientos_administrativos_en_forma_de_juicio","_.13_Derechos_de_autor","_.6_Proteccion_de_datos_personales","_.9_Obligaciones_de_transparencia","_.13_Derechos_de_autor","_.14_Administración_de_bibliotecas","_.7_Procedimientos_penales","_.7_Procedimientos_administrativos_no_contenciosos","_.11_Derechos_Universitarios","_.8_Prácticas_académicas"]
[null,".4 .1 Planes y programas de estudio incorporados",".5 .1 Planes, tablas y programas de estudio",".11 .1 Programas de servicio social",".19 .1 Evaluaciones y exámenes",".3 .1 Vinculación con egresados de la Universidad Nacional Autónoma de México",".3 .1 Estatutos",".9 .1 Revisiones fiscales",".10 .1 Pedimentos, solicitudes y requerimientos de autoridad competente en materia penal",".13 .1 Quejas y recomendaciones en materia de Derechos Universitarios",".12 .1 Marcas",".6 .1 Plan de Desarrollo Institucional",".7 .1 Identidad digital",".13 .1 Programas y proyectos en materia de organización, descripción, conservación, migración y restauración de documentos",".18 .1 Adquisiciones bibliográficas",".5 .1 Procedimientos de responsabilidad administrativa",".13 .1 Obras artísticas y literarias",".6. .1 Ejercicio de derechos ARCO",".9 .1 Cumplimiento de obligaciones de transaparencia",".15 .1 Obras artísticas y literarias",".14 .1 Adquisiciones bibliográficas",".7 .1 Revisiones fiscales",".7 .1 Revisiones fiscales",".11 .1 Quejas y recomendaciones en materia de Derechos Universitarios",".8 .1 Programas de prácticas profesionales"]
[null,".4 .2 Supervisión a las instituciones incorporadas",".5 .2 Validez académica",".11 .2 Prestación y liberación del servicio social",".19 .2 Evaluación de la docencia, tutoría y enseñanza colectiva",".3 .2 Extensión universitaria",".3 .2 Reglamentos",".9 .2 Inspecciones",".10 .2 Pedimentos, solicitudes y requerimientos judiciales",".13 .2 Remisiones",".12 .2 Avisos y nombres comerciales",".6 .2 Programa de trabajo institucional",".7 .2 Seguridad de la información",".13 .2 Emisión de instrumentos de control y consulta archivística",".18 .2 Procesos técnicos",".5 .2 Inconformidades",".13 .2 Registro legal de publicaciones periódicas",".6 .2 Verificación en materia de protección de datos personales",".9 .2 Denuncias por incumplimiento",".15 .2 Registro legal de publicaciones periódicas",".14 .2 Procesos técnicos",".7 .2 Inspecciones",".7 .2 Inspecciones",".11 .2 Remisiones",".8 .2 Prestación de prácticas profesionales"]
[null,".4 .3 Asesoría, orientación y consulta sobre el proceso de incorporación de estudios a la Universidad Nacional Autónoma de México",".5 .3 Equivalencias de estudios, títulos y grados",".11 .3 Orientación educativa",".19 .3 Seguimiento de egresados y estudios con empleadores y expertos",null,null,".9 .3 Importaciones",".10 .3 Solicitud de peritos",null,".12 .3 Patentes",".6 .3 Informes institucionales",null,".13 .3 Registro y control de archivos",".18 .3 Descarte de material o baja",".5 .3 Sanciones a proveedores y contratistas",null,null,null,null,".14 .3 Descarte de material o baja",".7 .3 Importaciones",".7 .3 Importaciones"]
[null,".4 .4 Calendarios académicos y administrativos del sistema incorporado",".5 .4 Opinión académica de estudios",".11 .4 Vinculación de alumnos, estudiantes y egresados",null,null,null,null,null,null,".12 .4 Modelos de utilidad",".6 .4 Planes de desarrollo ",null,".13 .4 Diligencia, registro y control documental",".18 .4 Servicios bibliotecarios y de información",null,null,null,null,null,".14 .4 Servicios bibliotecarios y de información"]
[null,".4 .5 Directores técnicos y profesorado de las instituciones incorporadas",".5 .5 Asesoría, orientación y consulta en materia de revalidación y equivalencia de estudios",null,null,null,null,null,null,null,".12 .5 Diseños industriales",".6 .5 Programas de trabajo ",null,".13 .5 Descripción documental",".18 .5 Cooperación bibliotecaria",null,null,null,null,null,".14 .5 Cooperación bibliotecaria"]
[null,null,null,null,null,null,null,null,null,null,".12 .6 Variedades vegetales",".6 .6 Informes",null,".13 .6  Préstamo y consulta de expedientes"]
[null,null,null,null,null,null,null,null,null,null,null,null,null,".13 .7 Transferencia primaria"]
[null,null,null,null,null,null,null,null,null,null,null,null,null,".13 .8Transferencia secundaria"]
[null,null,null,null,null,null,null,null,null,null,null,null,null,".13 .9 Incorporación, donación y resguardo patrimonial"]
[null,null,null,null,null,null,null,null,null,null,null,null,null,".13 .10 Traslado de archivos"]
[null,null,null,null,null,null,null,null,null,null,null,null,null,".13 .11 Baja documental"]
[null,null,null,null,null,null,null,null,null,null,null,null,null,".13 .12 Documentación siniestrada o con riesgo sanitario"]
[null,null,null,null,null,null,null,null,null,null,null,null,null,".13 .13 Eliminación de documentos de apoyo informativo"]
[null,null,null,null,null,null,null,null,null,null,null,null,null,".13 .14 Supervisiones archivísticas"]
[null,null,null,null,null,null,null,null,null,null,null,null,null,".13 .15 Asistencia, asesoría y consulta en materia de archivos"]

{"sheet":"Rótulo","index":2,"n_rows":20,"n_cols":14,"rows_kept":20,"cut":false,"hidden":false,"merged":[[7,1,7,14],[8,1,8,14],[9,1,9,14],[10,2,10,14],[1,0,1,14],[2,0,2,14],[4,0,4,14],[5,1,5,14],[6,1,6,14],[3,5,3,6],[19,3,19,6],[19,9,19,13],[20,1,20,13],[44,0,44,7],[11,1,11,14],[12,1,12,14],[13,1,13,14],[14,1,14,13],[15,1,15,13],[16,1,16,8],[16,9,16,14]]}
[]
["AÑO"]
["CAJA DE ARCHIVO "]
[null,null,null,null,"No:"]
[]
["Sujeto obligado:","UNIVERSIDAD NACIONAL AUTÓNOMA DE MÉXICO"]
["Código Área Universitaria:"]
["Área universitaria:",{"$f":"VLOOKUP(B7,cat!A2:B268,2,FALSE)","v":{"$error":"#N/A"}}]
["Clave Área Productora:"]
["Área productora:"]
["Fondo:",null,"UNAM"]
["Sección:"]
["Serie:"]
["Subserie:"]
["Total de expedientes:"]
[null,"Valores documentales"]
[null,"Primarios",null,null,null,null,null,null,null,"Secundarios"]
[null,"A:",null,"L:",null,"F:",null,"C:",null,"E:",null,"T:",null,"I:"]
[]
["Plazos de conservación:",null,"AT:",null,null,null,null,null,"AC:"]

{"sheet":"Rótulo TP","index":3,"n_rows":22,"n_cols":14,"rows_kept":22,"cut":false,"hidden":false,"merged":[[3,2,3,3],[3,4,3,5],[17,1,17,13],[1,0,1,14],[2,0,2,14],[5,1,5,14],[6,1,6,14],[7,1,7,14],[8,1,8,14],[9,1,9,14],[15,1,15,14],[13,1,13,14],[14,1,14,14],[4,0,4,14],[10,1,10,14],[11,1,11,14],[12,2,12,14],[46,0,46,7],[16,1,16,13],[18,1,18,8],[21,3,21,6],[21,9,21,13],[22,1,22,13],[18,9,18,14]]}
[]
["AÑO"]
["CAJA DE ARCHIVO TRANSFERENCIA PRIMARIA"]
[null,null,"No:"]
[]
["Sujeto obligado:","UNIVERSIDAD NACIONAL AUTÓNOMA DE MÉXICO"]
["Código Área Universitaria:","Código del Área"]
["Área universitaria:",{"$f":"VLOOKUP(B7,cat!A2:B268,2,FALSE)","v":{"$error":"#N/A"}}]
["Clave Área Productora:"]
["Área productora:"]
["transferencia primaria:"]
["Fecha de transferencia:"]
["Fondo:",null,"UNAM"]
["Sección:"]
["Serie:"]
["Subserie:"]
["Total de expedientes:"]
[null,"Valores documentales"]
[null,"Primarios",null,null,null,null,null,null,null,"Secundarios"]
[null,"A:",null,"L:",null,"F:",null,"C:",null,"E:",null,"T:",null,"I:"]
[]
["Plazos de conservación:",null,"AT:",null,null,null,null,null,"AC:"]

{"sheet":"Rótulo TS","index":4,"n_rows":22,"n_cols":14,"rows_kept":22,"cut":false,"hidden":false,"merged":[[12,2,12,14],[1,0,1,14],[2,0,2,14],[4,0,4,14],[5,1,5,14],[6,1,6,14],[7,1,7,14],[8,1,8,14],[9,1,9,14],[10,1,10,14],[11,1,11,14],[3,2,3,3],[3,4,3,5],[21,3,21,6],[21,9,21,13],[22,1,22,13],[46,0,46,7],[13,1,13,14],[14,1,14,14],[15,1,15,14],[16,1,16,13],[17,1,17,13],[18,1,18,8],[18,9,18,14]]}
[]
["AÑO"]
["CAJA DE ARCHIVO TRANSFERENCIA SECUNDARIA"]
[null,null,"No:"]
[]
["Sujeto obligado:","UNIVERSIDAD NACIONAL AUTÓNOMA DE MÉXICO"]
["Código Área Universitaria:","Código del Área"]
["Área universitaria:",{"$f":"VLOOKUP(B7,cat!A2:B268,2,FALSE)","v":{"$error":"#N/A"}}]
["Clave Área Productora:"]
["Área productora:"]
["transferencia secundaria:"]
["Fecha de transferencia:"]
["Fondo:",null,"UNAM"]
["Sección:"]
["Serie:"]
["Subserie:"]
["Total de expedientes:"]
[null,"Valores documentales"]
[null,"Primarios",null,null,null,null,null,null,null,"Secundarios"]
[null,"A:",null,"L:",null,"F:",null,"C:",null,"E:",null,"T:",null,"I:"]
[]
["Plazos de conservación:",null,"AT:",null,null,null,null,null,"AC:"]

{"sheet":"Rótulo Bd","index":5,"n_rows":20,"n_cols":14,"rows_kept":20,"cut":false,"hidden":false,"merged":[[1,0,1,14],[2,0,2,14],[5,1,5,14],[6,1,6,14],[3,2,3,3],[3,4,3,5],[19,3,19,6],[19,9,19,13],[20,1,20,13],[44,0,44,7],[4,0,4,14],[12,1,12,14],[13,1,13,14],[14,1,14,13],[15,1,15,13],[16,1,16,8],[16,9,16,14],[7,1,7,14],[8,1,8,14],[9,1,9,14],[10,2,10,14],[11,1,11,14]]}
[]
["AÑO"]
["CAJA DE ARCHIVO BAJA DOCUMENTAL"]
[null,null,"No:"]
[]
["Código Área Universitaria:","Código del Área"]
["Área universitaria:",{"$f":"VLOOKUP(B6,cat!A2:B268,2,FALSE)","v":{"$error":"#N/A"}}]
["Clave Área Productora:"]
["Área productora:"]
["baja documental:"]
["Fondo:",null,"UNAM"]
["Sección:"]
["Serie:"]
["Subserie:"]
["Total de expedientes:"]
[null,"Valores documentales"]
[null,"Primarios",null,null,null,null,null,null,null,"Secundarios"]
[null,"A:",null,"L:",null,"F:",null,"C:",null,"E:",null,"T:",null,"I:"]
[]
["Plazos de conservación:",null,"AT:",null,null,null,null,null,"AC:"]